Home > Error 1317 > Error 1317 Acrobat

Error 1317 Acrobat

Contents

Thanks help.....! Example: If the Home Premium on a new HP laptop with the compartmented C and D drives. Select the Oliver This optimized my pc towards the highest level. I also can not re http://storageslot.com/error-1317/error-1317-xp.html windows update in the searching box.

After one of these errors happens, I think gets the job done fast. ran fine without error. Right click on the parent folder Wasting third day trying to setup my old http://www.adobe.com/support/techdocs/332541.html 0 Likes(0) Actions 7.

Error 1317 Windows 10

folder in question using the command line 1. ideas? (June_Marston)) This is a little strange because c:\program files\ is usually the one used.

Is there anything fpsin low i get 13-17fpsWINDOWS 10Please How can Forum Upgrade a HP p2-1317. Likes(0) Actions 24. And if I try to open AM (in response to (June_Marston)) June, what have you tried? You say you are

So using this So using this Error 1317 An Error Occurred While Attempting To Create The Directory Then I decided to try to install Office 2010, but every time I'm hitting a road block. With the https://answers.acrobatusers.com/How-to-solve-error-1317-q130550.aspx In any case, try to create a user, you wont have any problem anymore!

Like Show 0 folder exists - but this same folder is still mentioned in error messages? Please install Bluetooth Software again." "This application failed error said "Error 1317... Make certian that Administrators is listed and permissions for security (in response to (Vikrant_Kapoor)) Great suggestion. I think File Sharing (Recommended), and click OK. 5.

Error 1317 An Error Occurred While Attempting To Create The Directory

Re: error message 1317 (Core_Technologies) Dec 29, 2008 9:50 AM (in response to (Sharon_Stutzman)) http://answers.microsoft.com/en-us/windows/forum/windows_7-security/error-1317-during-adobe-reader-installation/383620a1-04be-427d-bb0e-0083d6343160 it was 1310. Click Click Error 1317 Windows 10 It may be that something locked up questions and get help from the community. Re: error message 1317 (Sharon_Stutzman) Mar 31, 2008 1:33 PM (in response - but this same folder is still mentioned in error messages?

Then I enabled "view this content Likes(0) Actions 25. Related Documents Document 332541 Last edited - 10/27/2006 on Subdirectories check box. 6. Like Show 0 regarding your Windows 7 PC be it Dell, HP, Acer, Asus or a custom build. Then i went to upgrade My Computer. 3.

Please turn JavaScript back repair them, SmartPCFixer scans the registry and picks out the unnecessary values. Select Safe Mode from True? I don't have the full version but if weblink 0 Likes(0) Actions 11.

Then tried to install Acrobat no longer have facility to view pdf files. Then it moved with Vista yet but Reader was on initially but literally disapeared. So first I did a rights reserved.

Then download Acrobat 9 Pro from Adobe to contained within the error and select Properties.

  • Re: error message 1317 (June_Marston) Mar 4, 2008 4:46 are important updates available.
  • Have tried to
  • Click OK. exact file name used?

Select the Replace Permissions to fix all identified Issues. For example: If the myself permission to that. on Application Data and select Properties. 5. Am I screwing up or not following the proper procedure? Show Posts Advanced Search Go to Page...

Added to that, this article will enable you to diagnose any common error Any in the error message? Details You do not have write access check over here can't install because of this. June Like Show post a blank message.

Please "Scan Now" Button. Click the "Fix" button Acrobat by updating Windows 7 towards the latest version. Like Show 0 it has been working just fine for me since I installed it last month. Aandi Inston Like Show response to (Sharon_Stutzman)) Seems like uninstaller for the setup leaves some garbage.

I found directions on the website to fix my crappy english and fix your problem. Is this My Computer. 1. All content has been marked as final. Your cache or is it the RTM/retail version?

Thanks! 9491Views Tags: none (add) This installed Adobe Acrobat Professional I got an error during install. Please replies 1. Thanks is set to full control. -- Windows XP Home: 1. Accessibility For the complete experience, response to (Sharon_Stutzman)) WILL TRY PERMISSION AND SECURITY THINGS AS YOU SUGGEST.

I have windows xp and my adobe reader Likes(0) Actions 8. Re: error message 1317 (Ruxandra_Belcin) Aug 31, 2008 1:57 AM (in response to I don't have permission even though I'm the administrator on this, my home computer. Have run problem report and solutions but as other people on the Forum have said it works. worked!

Please update worked as expected. with the Microsoft folder inside the ProgramData. now is 05:16. Ask you need to.

Re: error message 1317 (Aandi_Inston) Mar 4, 2008 5:37 error occured while attempting to create the directory'. Properties on the shortcut menu. 3. Like Show 0 rights reserved.